{"text_format":"1","workbook":"xlsx","n_sheets":5,"sheets":["Instrucciones","INICIO","AGENDA","PESO","AUXILIAR"],"not_rendered":{"charts":1,"images":5,"macros":1,"external_links":0,"defined_names":14,"comments":0,"pivot_tables":0},"unopened":[],"bounds":{"document_bytes":16777216,"sheet_cells":100000,"rows_first":2000,"rows_last":500,"rows_between":2000,"halvings":0,"cell_chars":16384,"cell_head_chars":4096},"cells_cut":0,"cells_raw":0,"read":"whole","date_system":"1900"}

{"sheet":"Instrucciones","index":0,"n_rows":23,"n_cols":3,"rows_kept":23,"cut":false,"hidden":false,"merged":[[8,1,8,7],[20,1,20,7],[1,1,2,6],[22,0,22,7],[5,1,5,7],[6,1,6,7],[7,1,7,7],[10,1,10,7],[11,1,11,7],[12,1,12,7],[15,1,15,7],[16,1,16,7],[18,1,18,7]]}
[]
[null,"VIVIR LA MATERNIDAD"]
[]
[]
["INICIO"]
[null,"En la pestaña INICIO debes indicar la fecha del primer día de la última regla"]
[null,"La hoja calculará automáticamente la fecha probable de parto, los días que faltan"]
[null,"para ver al bebé y las semanas de embarazo"]
[null,"Esta fecha es importante para poner en funcionamiento la agenda"]
["AGENDA"]
[null,"En la pestaña AGENDA puedes ir apuntando anotaciones y el peso durante el embarazo"]
[null,"Los días que contengan anotaciones aparecerán en verde"]
[null,"Los días rosas contienen consejos de Vivir la Maternidad"]
[null,null,"Días con anotaciones"]
[null,null,"Días con consejos"]
[null,"Para guardar una anotación o el peso en un día, seleccione el día en el calendario"]
[null,"escriba la anotación y el peso, y después, pulse el botón GUARDAR"]
["PESO"]
[null,"En esta hoja se va pintando un gráfico de la evolución del peso durante el embarazo"]
[]
[null,"IMPORTANTE: No olvides guardar los cambios antes de salir"]
[]
["www.vivirlamaternidad.com"]

{"sheet":"INICIO","index":1,"n_rows":30,"n_cols":11,"rows_kept":30,"cut":false,"hidden":false,"merged":[[11,3,11,6],[12,1,12,4],[17,0,17,7],[1,1,2,5],[15,0,16,7],[9,3,9,6]]}
[]
[null,"VIVIR LA MATERNIDAD"]
[]
[]
[]
["Seleccione la fecha del primer día de la última regla"]
[null,null,null,"Día","Mes","Año"]
[null,null,null,1,10,2012]
[]
["Fecha de la última regla:",null,null,{"$f":"DATE(F8,E8,D8)","v":"2012-10-01"}]
[]
["Fecha probable de parto:",null,null,{"$f":"IF(D10<>\"\",D10+40*7,\"\")","v":"2013-07-08"}]
["Hoy es:",{"$f":"TODAY()","v":"2012-10-28"}]
["Quedan:",{"$f":"IF(D10<>\"\",D12-TODAY(),\"\")","v":253},"días para ver a tu bebé"]
["Semana de embarazo:",null,null,{"$f":"IF(D10<>\"\",TRUNC((TODAY()-D10)/7),\"\")","v":3},"semanas",{"$f":"IF(D10<>\"\",TODAY()-D10-(TRUNC((TODAY()-D10)/7)*7),\"\")","v":6},"días"]
["Consulta los primeros consejos en el embarazo"]
[]
["www.vivirlamaternidad.com"]
[]
[]
[]
[]
[]
[]
[]
[]
[]
[]
[]
[null,null,null,null,null,null,null,null,null,null,"06/03/2012"]

{"sheet":"AGENDA","index":2,"n_rows":469,"n_cols":9,"rows_kept":469,"cut":false,"hidden":false,"merged":[[6,0,8,8],[20,1,20,3],[2,1,3,7],[33,0,33,8],[22,1,22,2],[23,1,31,6],[11,1,11,7],[20,4,20,7],[4,0,5,8]]}
["2012-11-12",null,{"$f":"INICIO!D10","v":"2012-10-01"}]
[]
[null,"VIVIR LA MATERNIDAD"]
[]
["Consejo de Vivir la Maternidad"]
[]
["Tienes muchos recursos a tu disposición"]
[]
[]
[null,"Días con anotaciones"]
[null,"Días con consejos"]
[null,{"$f":"AUXILIAR!J23","v":"Noviembre 2012"}]
[null,{"$f":"AUXILIAR!J24","v":"Lunes"},{"$f":"AUXILIAR!K24","v":"Martes"},{"$f":"AUXILIAR!L24","v":"Miércoles"},{"$f":"AUXILIAR!M24","v":"Jueves"},{"$f":"AUXILIAR!N24","v":"Viernes"},{"$f":"AUXILIAR!O24","v":"Sábado"},{"$f":"AUXILIAR!P24","v":"Domingo"}]
[null,{"$f":"AUXILIAR!J25","v":""},{"$f":"AUXILIAR!K25","v":""},{"$f":"AUXILIAR!L25","v":""},{"$f":"AUXILIAR!M25","v":"2012-11-01"},{"$f":"AUXILIAR!N25","v":"2012-11-02"},{"$f":"AUXILIAR!O25","v":"2012-11-03"},{"$f":"AUXILIAR!P25","v":"2012-11-04"}]
[null,{"$f":"AUXILIAR!J26","v":"2012-11-05"},{"$f":"AUXILIAR!K26","v":"2012-11-06"},{"$f":"AUXILIAR!L26","v":"2012-11-07"},{"$f":"AUXILIAR!M26","v":"2012-11-08"},{"$f":"AUXILIAR!N26","v":"2012-11-09"},{"$f":"AUXILIAR!O26","v":"2012-11-10"},{"$f":"AUXILIAR!P26","v":"2012-11-11"}]
[null,{"$f":"AUXILIAR!J27","v":"2012-11-12"},{"$f":"AUXILIAR!K27","v":"2012-11-13"},{"$f":"AUXILIAR!L27","v":"2012-11-14"},{"$f":"AUXILIAR!M27","v":"2012-11-15"},{"$f":"AUXILIAR!N27","v":"2012-11-16"},{"$f":"AUXILIAR!O27","v":"2012-11-17"},{"$f":"AUXILIAR!P27","v":"2012-11-18"}]
[null,{"$f":"AUXILIAR!J28","v":"2012-11-19"},{"$f":"AUXILIAR!K28","v":"2012-11-20"},{"$f":"AUXILIAR!L28","v":"2012-11-21"},{"$f":"AUXILIAR!M28","v":"2012-11-22"},{"$f":"AUXILIAR!N28","v":"2012-11-23"},{"$f":"AUXILIAR!O28","v":"2012-11-24"},{"$f":"AUXILIAR!P28","v":"2012-11-25"}]
[null,{"$f":"AUXILIAR!J29","v":"2012-11-26"},{"$f":"AUXILIAR!K29","v":"2012-11-27"},{"$f":"AUXILIAR!L29","v":"2012-11-28"},{"$f":"AUXILIAR!M29","v":"2012-11-29"},{"$f":"AUXILIAR!N29","v":"2012-11-30"},{"$f":"AUXILIAR!O29","v":""},{"$f":"AUXILIAR!P29","v":""}]
[null,{"$f":"AUXILIAR!J30","v":""},{"$f":"AUXILIAR!K30","v":""},{"$f":"AUXILIAR!L30","v":""},{"$f":"AUXILIAR!M30","v":""},{"$f":"AUXILIAR!N30","v":""},{"$f":"AUXILIAR!O30","v":""},{"$f":"AUXILIAR!P30","v":""}]
[null,"",null,null,null,null,null,""]
[null,"Fecha seleccionada:",null,null,{"$f":"IF(AGENDA!$A$1<>\"\",$A$1,\"\")","v":"2012-11-12"}]
[]
[null,"Anotaciones",null,null,null,null,null,"Peso Kg"]
[null,"",null,null,null,null,null,""]
[]
[]
[]
[]
[]
[]
[]
[]
[]
["www.vivirlamaternidad.com"]
[]
[{"$f":"IF(AND(AGENDA!$A$1<>\"\",INDEX(tabladatos,AGENDA!$A$1-AGENDA!$C$1+1,1)<>\"\"),INDEX(tabladatos,AGENDA!$A$1-AGENDA!$C$1+1,1),\"\")","v":43},{"$f":"IF(AND(AGENDA!$A$1<>\"\",INDEX(tabladatos,AGENDA!$A$1-AGENDA!$C$1+1,2)<>\"\"),INDEX(tabladatos,AGENDA!$A$1-AGENDA!$C$1+1,2),\"\")","v":""},{"$f":"IF(AND(AGENDA!$A$1<>\"\",INDEX(tabladatos,AGENDA!$A$1-AGENDA!$C$1+1,3)<>\"\"),INDEX(tabladatos,AGENDA!$A$1-AGENDA!$C$1+1,3),\"\")","v":""},{"$f":"IF(AND(AGENDA!$A$1<>\"\",INDEX(tabladatos,AGENDA!$A$1-AGENDA!$C$1+1,4)<>\"\"),INDEX(tabladatos,AGENDA!$A$1-AGENDA!$C$1+1,4),\"\")","v":""},{"$f":"IF(AND(AGENDA!$A$1<>\"\",INDEX(tabladatos,AGENDA!$A$1-AGENDA!$C$1+1,5)<>\"\"),INDEX(tabladatos,AGENDA!$A$1-AGENDA!$C$1+1,5),\"\")","v":""},{"$f":"IF(AND(AGENDA!$A$1<>\"\",INDEX(tabladatos,AGENDA!$A$1-AGENDA!$C$1+1,6)<>\"\"),INDEX(tabladatos,AGENDA!$A$1-AGENDA!$C$1+1,6),\"\")","v":"http://www.vivirlamaternidad.com/material-de-consulta/menu-embarazo/recursos"},{"$f":"IF(AND(AGENDA!$A$1<>\"\",INDEX(tabladatos,AGENDA!$A$1-AGENDA!$C$1+1,7)<>\"\"),INDEX(tabladatos,AGENDA!$A$1-AGENDA!$C$1+1,7),\"\")","v":"Tienes muchos recursos a tu disposición"},{"$f":"IF(AND(AGENDA!$A$1<>\"\",INDEX(tabladatos,AGENDA!$A$1-AGENDA!$C$1+1,8)<>\"\"),INDEX(tabladatos,AGENDA!$A$1-AGENDA!$C$1+1,8),\"\")","v":""},{"$f":"IF(AND(AGENDA!$A$1<>\"\",INDEX(tabladatos,AGENDA!$A$1-AGENDA!$C$1+1,9)<>\"\"),INDEX(tabladatos,AGENDA!$A$1-AGENDA!$C$1+1,9),\"\")","v":""}]
[1,null,null,null,null,"http://www.vivirlamaternidad.com/consejos-practicos/durante-el-embarazo","Primeros consejos en el embarazo"]
[2]
[3]
[4]
[5]
[6]
[7]
[8]
[9]
[10]
[11]
[12]
[13]
[14]
[15]
[16]
[17]
[18]
[19]
[20]
[21]
[22]
[23]
[24]
{"$rows_left_out":410}
{"sheet":"PESO","index":3,"n_rows":718,"n_cols":16,"rows_kept":718,"cut":false,"hidden":false,"merged":[[24,0,24,7],[1,1,2,5],[18,3,18,6],[19,1,19,4],[22,0,23,7]]}
[null,null,null,null,null,null,null,null,null,null,null,null,null,null,null,{"$f":"IF(AGENDA!C37<>\"\",AGENDA!C37,\"\")","v":""}]
[null,"VIVIR LA MATERNIDAD",null,null,null,null,null,null,null,null,null,null,null,null,null,{"$f":"IF(AGENDA!C38<>\"\",AGENDA!C38,\"\")","v":""}]
[null,null,null,null,null,null,null,null,null,null,null,null,null,null,null,{"$f":"IF(AGENDA!C39<>\"\",AGENDA!C39,\"\")","v":""}]
[null,null,null,null,null,null,null,null,null,null,null,null,null,null,null,{"$f":"IF(AGENDA!C40<>\"\",AGENDA!C40,\"\")","v":""}]
[null,null,null,null,null,null,null,null,null,null,null,null,null,null,null,{"$f":"IF(AGENDA!C41<>\"\",AGENDA!C41,\"\")","v":""}]
[null,null,null,null,null,null,null,null,null,null,null,null,null,null,null,{"$f":"IF(AGENDA!C42<>\"\",AGENDA!C42,\"\")","v":""}]
[null,null,null,null,null,null,null,null,null,null,null,null,null,null,null,{"$f":"IF(AGENDA!C43<>\"\",AGENDA!C43,\"\")","v":""}]
[null,null,null,null,null,null,null,null,null,null,null,null,null,null,null,{"$f":"IF(AGENDA!C44<>\"\",AGENDA!C44,\"\")","v":""}]
[null,null,null,null,null,null,null,null,null,null,null,null,null,null,null,{"$f":"IF(AGENDA!C45<>\"\",AGENDA!C45,\"\")","v":""}]
[null,null,null,null,null,null,null,null,null,null,null,null,null,null,null,{"$f":"IF(AGENDA!C46<>\"\",AGENDA!C46,\"\")","v":""}]
[null,null,null,null,null,null,null,null,null,null,null,null,null,null,null,{"$f":"IF(AGENDA!C47<>\"\",AGENDA!C47,\"\")","v":""}]
[null,null,null,null,null,null,null,null,null,null,null,null,null,null,null,{"$f":"IF(AGENDA!C48<>\"\",AGENDA!C48,\"\")","v":""}]
[null,null,null,null,null,null,null,null,null,null,null,null,null,null,null,{"$f":"IF(AGENDA!C49<>\"\",AGENDA!C49,\"\")","v":""}]
[null,null,null,null,null,null,null,null,null,null,null,null,null,null,null,{"$f":"IF(AGENDA!C50<>\"\",AGENDA!C50,\"\")","v":""}]
[null,null,null,null,null,null,null,null,null,null,null,null,null,null,null,{"$f":"IF(AGENDA!C51<>\"\",AGENDA!C51,\"\")","v":""}]
[null,null,null,null,null,null,null,null,null,null,null,null,null,null,null,{"$f":"IF(AGENDA!C52<>\"\",AGENDA!C52,\"\")","v":""}]
[null,null,null,null,null,null,null,null,null,null,null,null,null,null,null,{"$f":"IF(AGENDA!C53<>\"\",AGENDA!C53,\"\")","v":""}]
[null,null,null,null,null,null,null,null,null,null,null,null,null,null,null,{"$f":"IF(AGENDA!C54<>\"\",AGENDA!C54,\"\")","v":""}]
[null,null,null,null,null,null,null,null,null,null,null,null,null,null,null,{"$f":"IF(AGENDA!C55<>\"\",AGENDA!C55,\"\")","v":""}]
[null,null,null,null,null,null,null,null,null,null,null,null,null,null,null,{"$f":"IF(AGENDA!C56<>\"\",AGENDA!C56,\"\")","v":""}]
[null,null,null,null,null,null,null,null,null,null,null,null,null,null,null,{"$f":"IF(AGENDA!C57<>\"\",AGENDA!C57,\"\")","v":""}]
[null,null,null,null,null,null,null,null,null,null,null,null,null,null,null,{"$f":"IF(AGENDA!C58<>\"\",AGENDA!C58,\"\")","v":""}]
["Información sobre nutrición en el embarazo",null,null,null,null,null,null,null,null,null,null,null,null,null,null,{"$f":"IF(AGENDA!C59<>\"\",AGENDA!C59,\"\")","v":""}]
[null,null,null,null,null,null,null,null,null,null,null,null,null,null,null,{"$f":"IF(AGENDA!C60<>\"\",AGENDA!C60,\"\")","v":""}]
["www.vivirlamaternidad.com",null,null,null,null,null,null,null,null,null,null,null,null,null,null,{"$f":"IF(AGENDA!C61<>\"\",AGENDA!C61,\"\")","v":""}]
[null,null,null,null,null,null,null,null,null,null,null,null,null,null,null,{"$f":"IF(AGENDA!C62<>\"\",AGENDA!C62,\"\")","v":""}]
[null,null,null,null,null,null,null,null,null,null,null,null,null,null,null,{"$f":"IF(AGENDA!C63<>\"\",AGENDA!C63,\"\")","v":""}]
[null,null,null,null,null,null,null,null,null,null,null,null,null,null,null,{"$f":"IF(AGENDA!C64<>\"\",AGENDA!C64,\"\")","v":""}]
[null,null,null,null,null,null,null,null,null,null,null,null,null,null,null,{"$f":"IF(AGENDA!C65<>\"\",AGENDA!C65,\"\")","v":""}]
[null,null,null,null,null,null,null,null,null,null,null,null,null,null,null,{"$f":"IF(AGENDA!C66<>\"\",AGENDA!C66,\"\")","v":""}]
[null,null,null,null,null,null,null,null,null,null,null,null,null,null,null,{"$f":"IF(AGENDA!C67<>\"\",AGENDA!C67,\"\")","v":""}]
[null,null,null,null,null,null,null,null,null,null,null,null,null,null,null,{"$f":"IF(AGENDA!C68<>\"\",AGENDA!C68,\"\")","v":""}]
[null,null,null,null,null,null,null,null,null,null,null,null,null,null,null,{"$f":"IF(AGENDA!C69<>\"\",AGENDA!C69,\"\")","v":""}]
[null,null,null,null,null,null,null,null,null,null,null,null,null,null,null,{"$f":"IF(AGENDA!C70<>\"\",AGENDA!C70,\"\")","v":""}]
[null,null,null,null,null,null,null,null,null,null,null,null,null,null,null,{"$f":"IF(AGENDA!C71<>\"\",AGENDA!C71,\"\")","v":""}]
[null,null,null,null,null,null,null,null,null,null,null,null,null,null,null,{"$f":"IF(AGENDA!C72<>\"\",AGENDA!C72,\"\")","v":""}]
[null,null,null,null,null,null,null,null,null,null,null,null,null,null,null,{"$f":"IF(AGENDA!C73<>\"\",AGENDA!C73,\"\")","v":""}]
[null,null,null,null,null,null,null,null,null,null,null,null,null,null,null,{"$f":"IF(AGENDA!C74<>\"\",AGENDA!C74,\"\")","v":""}]
[null,null,null,null,null,null,null,null,null,null,null,null,null,null,null,{"$f":"IF(AGENDA!C75<>\"\",AGENDA!C75,\"\")","v":""}]
[null,null,null,null,null,null,null,null,null,null,null,null,null,null,null,{"$f":"IF(AGENDA!C76<>\"\",AGENDA!C76,\"\")","v":""}]
[null,null,null,null,null,null,null,null,null,null,null,null,null,null,null,{"$f":"IF(AGENDA!C77<>\"\",AGENDA!C77,\"\")","v":""}]
[null,null,null,null,null,null,null,null,null,null,null,null,null,null,null,{"$f":"IF(AGENDA!C78<>\"\",AGENDA!C78,\"\")","v":""}]
[null,null,null,null,null,null,null,null,null,null,null,null,null,null,null,{"$f":"IF(AGENDA!C79<>\"\",AGENDA!C79,\"\")","v":""}]
[null,null,null,null,null,null,null,null,null,null,null,null,null,null,null,{"$f":"IF(AGENDA!C80<>\"\",AGENDA!C80,\"\")","v":""}]
[null,null,null,null,null,null,null,null,null,null,null,null,null,null,null,{"$f":"IF(AGENDA!C81<>\"\",AGENDA!C81,\"\")","v":""}]
[null,null,null,null,null,null,null,null,null,null,null,null,null,null,null,{"$f":"IF(AGENDA!C82<>\"\",AGENDA!C82,\"\")","v":""}]
[null,null,null,null,null,null,null,null,null,null,null,null,null,null,null,{"$f":"IF(AGENDA!C83<>\"\",AGENDA!C83,\"\")","v":""}]
[null,null,null,null,null,null,null,null,null,null,null,null,null,null,null,{"$f":"IF(AGENDA!C84<>\"\",AGENDA!C84,\"\")","v":""}]
[null,null,null,null,null,null,null,null,null,null,null,null,null,null,null,{"$f":"IF(AGENDA!C85<>\"\",AGENDA!C85,\"\")","v":""}]
[null,null,null,null,null,null,null,null,null,null,null,null,null,null,null,{"$f":"IF(AGENDA!C86<>\"\",AGENDA!C86,\"\")","v":""}]
[null,null,null,null,null,null,null,null,null,null,null,null,null,null,null,{"$f":"IF(AGENDA!C87<>\"\",AGENDA!C87,\"\")","v":""}]
[null,null,null,null,null,null,null,null,null,null,null,null,null,null,null,{"$f":"IF(AGENDA!C88<>\"\",AGENDA!C88,\"\")","v":""}]
[null,null,null,null,null,null,null,null,null,null,null,null,null,null,null,{"$f":"IF(AGENDA!C89<>\"\",AGENDA!C89,\"\")","v":""}]
[null,null,null,null,null,null,null,null,null,null,null,null,null,null,null,{"$f":"IF(AGENDA!C90<>\"\",AGENDA!C90,\"\")","v":""}]
[null,null,null,null,null,null,null,null,null,null,null,null,null,null,null,{"$f":"IF(AGENDA!C91<>\"\",AGENDA!C91,\"\")","v":""}]
[null,null,null,null,null,null,null,null,null,null,null,null,null,null,null,{"$f":"IF(AGENDA!C92<>\"\",AGENDA!C92,\"\")","v":""}]
[null,null,null,null,null,null,null,null,null,null,null,null,null,null,null,{"$f":"IF(AGENDA!C93<>\"\",AGENDA!C93,\"\")","v":""}]
[null,null,null,null,null,null,null,null,null,null,null,null,null,null,null,{"$f":"IF(AGENDA!C94<>\"\",AGENDA!C94,\"\")","v":""}]
[null,null,null,null,null,null,null,null,null,null,null,null,null,null,null,{"$f":"IF(AGENDA!C95<>\"\",AGENDA!C95,\"\")","v":""}]
[null,null,null,null,null,null,null,null,null,null,null,null,null,null,null,{"$f":"IF(AGENDA!C96<>\"\",AGENDA!C96,\"\")","v":""}]
{"$rows_left_out":659}
{"sheet":"AUXILIAR","index":4,"n_rows":39,"n_cols":32,"rows_kept":39,"cut":false,"hidden":true,"merged":[[13,9,13,15],[22,9,22,15],[31,9,31,15]]}
["Today's Date",null,"Month Names"]
[{"$f":"TODAY()","v":"2012-10-28"},null,"Enero"]
[{"$f":"MONTH(TODAY())+B3","v":11},1,"Febrero",null,null,"monthName",{"$f":"INDEX(monthNames,MONTH(G4))","v":"Noviembre"}]
[{"$f":"INDEX(monthNames,MONTH(G4))","v":"Noviembre"},null,"Marzo",null,null,"startDate",{"$f":"DATE(year,month,1)","v":"2012-11-01"}]
[{"$f":"YEAR(TODAY())","v":2012},null,"Abril",null,null,"startDayOfWeek",{"$f":"WEEKDAY(startDate)","v":5}]
[null,null,"Mayo",null,null,"prevMonth",{"$f":"DATE(YEAR(startDate-1),MONTH(startDate-1),1)","v":"2012-10-01"}]
["Fecha Seleccionada",null,"Junio",null,null,"prevMonthName",{"$f":"INDEX(monthNames,MONTH(G6))","v":"Octubre"}]
[null,null,"Julio",null,null,"nextMonth",{"$f":"DATE(YEAR(startDate+32),MONTH(startDate+32),1)","v":"2012-12-01"}]
[null,null,"Agosto",null,null,"nextMonthName",{"$f":"INDEX(monthNames,MONTH(G8))","v":"Diciembre"}]
[null,null,"Septiembre",null,null,"MonFirst",true]
[null,null,"Octubre"]
[null,null,"Noviembre",null,null,null,null,null,null,null,null,null,null,null,null,null,null,"SUNDAY First",null,null,null,null,null,null,null,"MONDAY First"]
[null,null,"Diciembre"]
[null,null,null,null,null,null,null,null,null,{"$f":"prevMonthName&\" \"&YEAR(prevMonth)","v":"Octubre 2012"},null,null,null,null,null,null,null,{"$f":"prevMonthName&\" \"&YEAR(prevMonth)","v":"Octubre 2012"},null,null,null,null,null,null,null,{"$f":"prevMonthName&\" \"&YEAR(prevMonth)","v":"Octubre 2012"}]
["WeekNo",{"$f":"IF(MonFirst,\"Monday\",\"Sunday\")","v":"Monday"},{"$f":"IF(MonFirst,\"Tuesday\",\"Monday\")","v":"Tuesday"},{"$f":"IF(MonFirst,\"Wednesday\",\"Tuesday\")","v":"Wednesday"},{"$f":"IF(MonFirst,\"Thursday\",\"Wednesday\")","v":"Thursday"},{"$f":"IF(MonFirst,\"Friday\",\"Thursday\")","v":"Friday"},{"$f":"IF(MonFirst,\"Saturday\",\"Friday\")","v":"Saturday"},{"$f":"IF(MonFirst,\"Sunday\",\"Saturday\")","v":"Sunday"},null,{"$f":"IF(MonFirst,Z15,#REF!)","v":"Lunes"},{"$f":"IF(MonFirst,AA15,S15)","v":"Martes"},"Miércoles","Jueves","Viernes","Sábado","Domingo",null,"Domingo","Lunes","Martes","Miércoles","Jueves","Viernes","Sábado",null,"Lunes","Martes","Miércoles","Jueves","Viernes","Sábado","Domingo"]
[null,1,2,3,4,5,6,7,null,{"$f":"IF(MonFirst,Z16,R16)","v":"2012-10-01"},"2012-10-02","2012-10-03","2012-10-04","2012-10-05","2012-10-06","2012-10-07",null,{"$f":"IF(MONTH(prevMonth)<>MONTH(prevMonth-WEEKDAY(prevMonth)+(WeekNo-1)*7+weekday),\"\",prevMonth-WEEKDAY(prevMonth)+(WeekNo-1)*7+weekday)","v":""},"2012-10-01","2012-10-02","2012-10-03","2012-10-04","2012-10-05","2012-10-06",null,{"$f":"IF(MONTH(prevMonth)<>MONTH(prevMonth-WEEKDAY(prevMonth,2)+(WeekNo-1)*7+weekday),\"\",prevMonth-WEEKDAY(prevMonth,2)+(WeekNo-1)*7+weekday)","v":"2012-10-01"},"2012-10-02","2012-10-03","2012-10-04","2012-10-05","2012-10-06","2012-10-07"]
[1,{"$f":"J25","v":""},"","","2012-11-01","2012-11-02","2012-11-03","2012-11-04",null,{"$f":"IF(MonFirst,Z17,R17)","v":"2012-10-08"},"2012-10-09","2012-10-10","2012-10-11","2012-10-12","2012-10-13","2012-10-14",null,"2012-10-07","2012-10-08","2012-10-09","2012-10-10","2012-10-11","2012-10-12","2012-10-13",null,"2012-10-08","2012-10-09","2012-10-10","2012-10-11","2012-10-12","2012-10-13","2012-10-14"]
[2,"2012-11-05","2012-11-06","2012-11-07","2012-11-08","2012-11-09","2012-11-10","2012-11-11",null,"2012-10-15","2012-10-16","2012-10-17","2012-10-18","2012-10-19","2012-10-20","2012-10-21",null,"2012-10-14","2012-10-15","2012-10-16","2012-10-17","2012-10-18","2012-10-19","2012-10-20",null,"2012-10-15","2012-10-16","2012-10-17","2012-10-18","2012-10-19","2012-10-20","2012-10-21"]
[3,"2012-11-12","2012-11-13","2012-11-14","2012-11-15","2012-11-16","2012-11-17","2012-11-18",null,"2012-10-22","2012-10-23","2012-10-24","2012-10-25","2012-10-26","2012-10-27","2012-10-28",null,"2012-10-21","2012-10-22","2012-10-23","2012-10-24","2012-10-25","2012-10-26","2012-10-27",null,"2012-10-22","2012-10-23","2012-10-24","2012-10-25","2012-10-26","2012-10-27","2012-10-28"]
[4,"2012-11-19","2012-11-20","2012-11-21","2012-11-22","2012-11-23","2012-11-24","2012-11-25",null,"2012-10-29","2012-10-30","2012-10-31","","","","",null,"2012-10-28","2012-10-29","2012-10-30","2012-10-31","","","",null,"2012-10-29","2012-10-30","2012-10-31","","","",""]
[5,"2012-11-26","2012-11-27","2012-11-28","2012-11-29","2012-11-30","","",null,"","","","","","","",null,"","","","","","","",null,"","","","","","",""]
[6,"","","","","","",""]
[null,null,null,null,null,null,null,null,null,{"$f":"monthName&\" \"&YEAR(startDate)","v":"Noviembre 2012"},null,null,null,null,null,null,null,{"$f":"monthName&\" \"&year","v":"Noviembre 2012"},null,null,null,null,null,null,null,{"$f":"monthName&\" \"&year","v":"Noviembre 2012"}]
["WeekNo","Sun","Mon","Tue","Wed","Thu","Fri","Sat",null,{"$f":"IF(MonFirst,Z24,R24)","v":"Lunes"},"Martes","Miércoles","Jueves","Viernes","Sábado","Domingo",null,"Domingo","Lunes","Martes","Miércoles","Jueves","Viernes","Sábado",null,"Lunes","Martes","Miércoles","Jueves","Viernes","Sábado","Domingo"]
[null,1,2,3,4,5,6,7,null,"","","","2012-11-01","2012-11-02","2012-11-03","2012-11-04",null,{"$f":"IF(MONTH(startDate)<>MONTH(startDate-startDayOfWeek+(WeekNo-1)*7+weekday),\"\",startDate-startDayOfWeek+(WeekNo-1)*7+weekday)","v":""},"","","","2012-11-01","2012-11-02","2012-11-03",null,{"$f":"IF(MONTH(startDate)<>MONTH(startDate-WEEKDAY(startDate,2)+(WeekNo-1)*7+weekday),\"\",startDate-WEEKDAY(startDate,2)+(WeekNo-1)*7+weekday)","v":""},"","","2012-11-01","2012-11-02","2012-11-03","2012-11-04"]
[1,{"$f":"J25","v":""},"","","2012-11-01","2012-11-02","2012-11-03","2012-11-04",null,{"$f":"IF(MonFirst,Z26,R26)","v":"2012-11-05"},"2012-11-06","2012-11-07","2012-11-08","2012-11-09","2012-11-10","2012-11-11",null,"2012-11-04","2012-11-05","2012-11-06","2012-11-07","2012-11-08","2012-11-09","2012-11-10",null,"2012-11-05","2012-11-06","2012-11-07","2012-11-08","2012-11-09","2012-11-10","2012-11-11"]
[2,"2012-11-05","2012-11-06","2012-11-07","2012-11-08","2012-11-09","2012-11-10","2012-11-11",null,"2012-11-12","2012-11-13","2012-11-14","2012-11-15","2012-11-16","2012-11-17","2012-11-18",null,"2012-11-11","2012-11-12","2012-11-13","2012-11-14","2012-11-15","2012-11-16","2012-11-17",null,"2012-11-12","2012-11-13","2012-11-14","2012-11-15","2012-11-16","2012-11-17","2012-11-18"]
[3,"2012-11-12","2012-11-13","2012-11-14","2012-11-15","2012-11-16","2012-11-17","2012-11-18",null,"2012-11-19","2012-11-20","2012-11-21","2012-11-22","2012-11-23","2012-11-24","2012-11-25",null,"2012-11-18","2012-11-19","2012-11-20","2012-11-21","2012-11-22","2012-11-23","2012-11-24",null,"2012-11-19","2012-11-20","2012-11-21","2012-11-22","2012-11-23","2012-11-24","2012-11-25"]
[4,"2012-11-19","2012-11-20","2012-11-21","2012-11-22","2012-11-23","2012-11-24","2012-11-25",null,"2012-11-26","2012-11-27","2012-11-28","2012-11-29","2012-11-30","","",null,"2012-11-25","2012-11-26","2012-11-27","2012-11-28","2012-11-29","2012-11-30","",null,"2012-11-26","2012-11-27","2012-11-28","2012-11-29","2012-11-30","",""]
[5,"2012-11-26","2012-11-27","2012-11-28","2012-11-29","2012-11-30","","",null,"","","","","","","",null,"","","","","","","",null,"","","","","","",""]
[6,"","","","","","",""]
[null,null,null,null,null,null,null,null,null,{"$f":"nextMonthName&\" \"&YEAR(nextMonth)","v":"Diciembre 2012"},null,null,null,null,null,null,null,{"$f":"nextMonthName&\" \"&YEAR(nextMonth)","v":"Diciembre 2012"},null,null,null,null,null,null,null,{"$f":"nextMonthName&\" \"&YEAR(nextMonth)","v":"Diciembre 2012"}]
[null,null,null,null,null,null,null,null,null,{"$f":"IF(MonFirst,Z33,R33)","v":"Lunes"},"Martes","Miércoles","Jueves","Viernes","Sábado","Domingo",null,"Domingo","Lunes","Martes","Miércoles","Jueves","Viernes","Sábado",null,"Lunes","Martes","Miércoles","Jueves","Viernes","Sábado","Domingo"]
[null,null,null,null,null,null,null,null,null,"","","","","","2012-12-01","2012-12-02",null,{"$f":"IF(MONTH(nextMonth)<>MONTH(nextMonth-WEEKDAY(nextMonth)+(WeekNo-1)*7+weekday),\"\",nextMonth-WEEKDAY(nextMonth)+(WeekNo-1)*7+weekday)","v":""},"","","","","","2012-12-01",null,{"$f":"IF(MONTH(nextMonth)<>MONTH(nextMonth-WEEKDAY(nextMonth,2)+(WeekNo-1)*7+weekday),\"\",nextMonth-WEEKDAY(nextMonth,2)+(WeekNo-1)*7+weekday)","v":""},"","","","","2012-12-01","2012-12-02"]
[null,null,null,null,null,null,null,null,null,{"$f":"IF(MonFirst,Z35,R35)","v":"2012-12-03"},"2012-12-04","2012-12-05","2012-12-06","2012-12-07","2012-12-08","2012-12-09",null,"2012-12-02","2012-12-03","2012-12-04","2012-12-05","2012-12-06","2012-12-07","2012-12-08",null,"2012-12-03","2012-12-04","2012-12-05","2012-12-06","2012-12-07","2012-12-08","2012-12-09"]
[null,null,null,null,null,null,null,null,null,"2012-12-10","2012-12-11","2012-12-12","2012-12-13","2012-12-14","2012-12-15","2012-12-16",null,"2012-12-09","2012-12-10","2012-12-11","2012-12-12","2012-12-13","2012-12-14","2012-12-15",null,"2012-12-10","2012-12-11","2012-12-12","2012-12-13","2012-12-14","2012-12-15","2012-12-16"]
[null,null,null,null,null,null,null,null,null,"2012-12-17","2012-12-18","2012-12-19","2012-12-20","2012-12-21","2012-12-22","2012-12-23",null,"2012-12-16","2012-12-17","2012-12-18","2012-12-19","2012-12-20","2012-12-21","2012-12-22",null,"2012-12-17","2012-12-18","2012-12-19","2012-12-20","2012-12-21","2012-12-22","2012-12-23"]
[null,null,null,null,null,null,null,null,null,"2012-12-24","2012-12-25","2012-12-26","2012-12-27","2012-12-28","2012-12-29","2012-12-30",null,"2012-12-23","2012-12-24","2012-12-25","2012-12-26","2012-12-27","2012-12-28","2012-12-29",null,"2012-12-24","2012-12-25","2012-12-26","2012-12-27","2012-12-28","2012-12-29","2012-12-30"]
[null,null,null,null,null,null,null,null,null,"2012-12-31","","","","","","",null,"2012-12-30","2012-12-31","","","","","",null,"2012-12-31","","","","","",""]